BDBM50011441 2-(4-Methoxy-phenyl)-4-oxo-4H-chromene-3-carboxylic acid::2-(4-methoxyphenyl)-4-oxo-4H-chromene-3-carboxylic acid::CHEMBL166949
SMILES COc1ccc(cc1)-c1oc2ccccc2c(=O)c1C(O)=O
InChI Key InChIKey=OLNAFSKQRRSJNG-UHFFFAOYSA-N
Data  1 IC50
  Tab Delimited (TSV)   2D SDfile   Computed 3D by Vconf -m prep SDfile
Find this compound or compounds like it in BindingDB:
Activity Spreadsheet -- Enzyme Inhibition Constant Data from BindingDB
Found 1 hit for monomerid = 50011441
TargetTyrosine-protein kinase Lck(Homo sapiens (Human))
Purdue University
Curated by ChEMBL
LigandPNGBDBM50011441(2-(4-Methoxy-phenyl)-4-oxo-4H-chromene-3-carboxyli...)
Affinity DataIC50: >2.00E+6nM. Assay description: Ability to inhibit protein-tyrosine kinase activity of p56lck (isolated from bovine thymus) in vitro.
In DepthDetails ArticlePubMed